Target
Anthrax toxin receptor 2
Ligand
BDBM50056937
Substrate
Meas. Tech.
ChEMBL_938547 (CHEMBL2327386)
IC50
50000±n/a nM
Citation
 Cryan, LMBazinet, LHabeshian, KACao, SClardy, JChristensen, KARogers, MS 1,2,3,4,6-Penta-O-galloyl-?-D-glucopyranose inhibits angiogenesis via inhibition of capillary morphogenesis gene 2. J Med Chem 56:1940-5 (2013)  
Target
Name:
Anthrax toxin receptor 2
Synonyms:
ANTR2_HUMAN Anthrax toxin receptor 2 CMG2 | Capillary morphogenesis gene 2 protein
Type:
PROTEIN
Mol. Mass.:
53667.55
Organism:
Homo sapiens
Description:
ChEMBL_118453
Residue:
489
  
Inhibitor
Name:
BDBM50056937
Synonyms:
3,4-dihydroxy-5-(3,4,5-trihydroxybenzoyloxy)benzoic acid Gallic acid 3-monogallate | digallic acid
Type:
Small organic molecule
Emp. Form.:
C14H10O9
Mol. Mass.:
322.2238
SMILES:
OC(=O)c1cc(O)c(O)c(OC(=O)c2cc(O)c(O)c(O)c2)c1
: