Target
Cytochrome P450 11B2, mitochondrial
Ligand
BDBM50035209
Substrate
Meas. Tech.
ChEMBL_192299 (CHEMBL795307)
IC50
3000±n/a nM
Citation
 Hartmann, RWBayer, HGrün, GSergejew, TBartz, UMitrenga, M Pyridyl-substituted tetrahydrocyclopropa[a]naphthalenes: highly active and selective inhibitors of P450 arom. J Med Chem 38:2103-11 (1995)  
Target
Name:
Cytochrome P450 11B2, mitochondrial
Synonyms:
Aldosterone synthase CYPXIB2 Cyp11b2 Cytochrome P450 11B2 P450-Aldo-1 | Steroid 11-beta-hydroxylase
Type:
PROTEIN
Mol. Mass.:
58260.64
Organism:
Rattus norvegicus
Description:
ChEMBL_224979
Residue:
510
  
Inhibitor
Name:
BDBM50035209
Synonyms:
4-(1a,2,3,7b-Tetrahydro-1H-cyclopropa[a]naphthalen-1-yl)-pyridine | CHEMBL304903
Type:
Small organic molecule
Emp. Form.:
C16H15N
Mol. Mass.:
221.297
SMILES:
C1Cc2ccccc2C2C1C2c1ccncc1
: