Target
Cytochrome P450 11B2, mitochondrial
Ligand
BDBM50035208
Substrate
Meas. Tech.
ChEMBL_177000 (CHEMBL779290)
IC50
7000±n/a nM
Citation
 Hartmann, RWBayer, HGrün, GSergejew, TBartz, UMitrenga, M Pyridyl-substituted tetrahydrocyclopropa[a]naphthalenes: highly active and selective inhibitors of P450 arom. J Med Chem 38:2103-11 (1995)  
Target
Name:
Cytochrome P450 11B2, mitochondrial
Synonyms:
Aldosterone synthase CYPXIB2 Cyp11b2 Cytochrome P450 11B2 P450-Aldo-1 | Steroid 11-beta-hydroxylase
Type:
PROTEIN
Mol. Mass.:
58260.64
Organism:
Rattus norvegicus
Description:
ChEMBL_224979
Residue:
510
  
Inhibitor
Name:
BDBM50035208
Synonyms:
1-Pyridin-4-yl-1a,2,3,7b-tetrahydro-1H-cyclopropa[a]naphthalen-6-ol | CHEMBL304583
Type:
Small organic molecule
Emp. Form.:
C16H15NO
Mol. Mass.:
237.2964
SMILES:
Oc1ccc2CCC3C(C3c2c1)c1ccncc1
: