Target
Cytochrome P450 11B2, mitochondrial
Ligand
BDBM50378780
Substrate
Meas. Tech.
ChEMBL_177001 (CHEMBL779291)
IC50
12000±n/a nM
Citation
 Hartmann, RWBayer, HGrün, GSergejew, TBartz, UMitrenga, M Pyridyl-substituted tetrahydrocyclopropa[a]naphthalenes: highly active and selective inhibitors of P450 arom. J Med Chem 38:2103-11 (1995)  
Target
Name:
Cytochrome P450 11B2, mitochondrial
Synonyms:
Aldosterone synthase CYPXIB2 Cyp11b2 Cytochrome P450 11B2 P450-Aldo-1 | Steroid 11-beta-hydroxylase
Type:
PROTEIN
Mol. Mass.:
58260.64
Organism:
Rattus norvegicus
Description:
ChEMBL_224979
Residue:
510
  
Inhibitor
Name:
BDBM50378780
Synonyms:
(S)-VOROZOLE
Type:
Small organic molecule
Emp. Form.:
C16H13ClN6
Mol. Mass.:
324.768
SMILES:
Cn1nnc2ccc(cc12)[C@H](c1ccc(Cl)cc1)n1cncn1
: