Target
Type-1 angiotensin II receptor
Ligand
BDBM50035431
Substrate
Meas. Tech.
ChEMBL_36631 (CHEMBL652870)
IC50
0.780000±n/a nM
Citation
 Chang, LLAshton, WTFlanagan, KLChen, TBO'Malley, SSZingaro, GJSiegl, PKKivlighn, SDLotti, VJChang, RS Triazolinone biphenylsulfonamides as angiotensin II receptor antagonists with high affinity for both the AT1 and AT2 subtypes. J Med Chem 37:4464-78 (1995)  
Target
Name:
Type-1 angiotensin II receptor
Synonyms:
AGTR1 ANGIOTENSIN AT1 Angiotensin II type 1a (AT-1a) receptor
Type:
Enzyme Catalytic Domain
Mol. Mass.:
41009.15
Organism:
RABBIT
Description:
ANGIOTENSIN AT1 AGTR1 RABBIT::P34976
Residue:
359
  
Inhibitor
Name:
BDBM50035431
Synonyms:
5-Butyl-4-[2'-(1H-tetrazol-5-yl)-biphenyl-4-ylmethyl]-2-(2-trifluoromethyl-phenyl)-2,4-dihydro-[1,2,4]triazol-3-one CHEMBL19018
Type:
Small organic molecule
Emp. Form.:
C27H24F3N7O
Mol. Mass.:
519.521
SMILES:
CCCCc1nn(-c2ccccc2C(F)(F)F)c(=O)n1Cc1ccc(cc1)-c1ccccc1-c1nnn[nH]1
: