Target
Urease subunit beta
Ligand
BDBM50099857
Substrate
Meas. Tech.
ChEMBL_956072 (CHEMBL2379097)
IC50
18200±n/a nM
Citation
 Xiao, ZPPeng, ZYDong, JJHe, JOuyang, HFeng, YTLu, CLLin, WQWang, JXXiang, YPZhu, HL Synthesis, structure-activity relationship analysis and kinetics study of reductive derivatives of flavonoids as Helicobacter pylori urease inhibitors. Eur J Med Chem 63:685-95 (2013)  
Target
Name:
Urease subunit beta
Synonyms:
3.5.1.5 Urea amidohydrolase subunit beta hpuB | ureB
Type:
PROTEIN
Mol. Mass.:
61676.43
Organism:
Helicobacter pylori (strain ATCC 700392 / 26695) (Campylobacterpylori)
Description:
ChEMBL_117195
Residue:
569
  
Inhibitor
Name:
BDBM50099857
Synonyms:
ACETOHYDROXAMIC ACID (AHA) Acethydroxamsaeure Acetic acid, oxime Cetohyroxamic acid Methylhydroxamic acid N-Acetylhydroxylamine acetohydroxamic acid
Type:
Small organic molecule
Emp. Form.:
C2H5NO2
Mol. Mass.:
75.0666
SMILES:
CC(=O)NO
: