Target
Sodium channel protein type 9 subunit alpha
Ligand
BDBM50491988
Substrate
Meas. Tech.
ChEMBL_964984 (CHEMBL2396017)
IC50
131±n/a nM
Citation
 Hoyt, SBLondon, CAbbadie, CFelix, JPGarcia, MLJochnowitz, NKaranam, BVLi, XLyons, KAMcGowan, EPriest, BTSmith, MMWarren, VAThomas-Fowlkes, BSKaczorowski, GJDuffy, JL A novel benzazepinone sodium channel blocker with oral efficacy in a rat model of neuropathic pain. Bioorg Med Chem Lett 23:3640-5 (2013)  
Target
Name:
Sodium channel protein type 9 subunit alpha
Synonyms:
NENA Peripheral sodium channel 1 SCN9A_HUMAN Voltage-gated sodium channel subunit Nav1.7 hNE-Na
Type:
Protein
Mol. Mass.:
226375.97
Organism:
Homo sapiens (Human)
Description:
Q15858
Residue:
1988
  
Inhibitor
Name:
BDBM50491988
Synonyms:
CHEMBL2391642
Type:
Small organic molecule
Emp. Form.:
C31H25F8N3O3
Mol. Mass.:
639.5357
SMILES:
CC1CC1N1c2c(F)cc(F)c(F)c2CC[C@@H](NC(=O)[C@@H](Cc2ccccc2F)NC(=O)c2ccc(F)cc2C(F)(F)F)C1=O
: