Target
Sodium channel protein type 9 subunit alpha
Ligand
BDBM50491989
Substrate
Meas. Tech.
ChEMBL_964984 (CHEMBL2396017)
IC50
117±n/a nM
Citation
 Hoyt, SBLondon, CAbbadie, CFelix, JPGarcia, MLJochnowitz, NKaranam, BVLi, XLyons, KAMcGowan, EPriest, BTSmith, MMWarren, VAThomas-Fowlkes, BSKaczorowski, GJDuffy, JL A novel benzazepinone sodium channel blocker with oral efficacy in a rat model of neuropathic pain. Bioorg Med Chem Lett 23:3640-5 (2013)  
Target
Name:
Sodium channel protein type 9 subunit alpha
Synonyms:
NENA Peripheral sodium channel 1 SCN9A_HUMAN Voltage-gated sodium channel subunit Nav1.7 hNE-Na
Type:
Protein
Mol. Mass.:
226375.97
Organism:
Homo sapiens (Human)
Description:
Q15858
Residue:
1988
  
Inhibitor
Name:
BDBM50491989
Synonyms:
CHEMBL2391791
Type:
Small organic molecule
Emp. Form.:
C27H24F7N3O3
Mol. Mass.:
571.4866
SMILES:
Fc1ccccc1C[C@@H](NC(=O)C1CC1C(F)(F)F)C(=O)N[C@@H]1CCc2c(F)c(F)cc(F)c2N(C2CC2)C1=O
: