Target
Sodium channel protein type 9 subunit alpha
Ligand
BDBM50491990
Substrate
Meas. Tech.
ChEMBL_964984 (CHEMBL2396017)
IC50
85±n/a nM
Citation
 Hoyt, SBLondon, CAbbadie, CFelix, JPGarcia, MLJochnowitz, NKaranam, BVLi, XLyons, KAMcGowan, EPriest, BTSmith, MMWarren, VAThomas-Fowlkes, BSKaczorowski, GJDuffy, JL A novel benzazepinone sodium channel blocker with oral efficacy in a rat model of neuropathic pain. Bioorg Med Chem Lett 23:3640-5 (2013)  
Target
Name:
Sodium channel protein type 9 subunit alpha
Synonyms:
NENA Peripheral sodium channel 1 SCN9A_HUMAN Voltage-gated sodium channel subunit Nav1.7 hNE-Na
Type:
Protein
Mol. Mass.:
226375.97
Organism:
Homo sapiens (Human)
Description:
Q15858
Residue:
1988
  
Inhibitor
Name:
BDBM50491990
Synonyms:
CHEMBL2391790
Type:
Small organic molecule
Emp. Form.:
C30H23F8N3O3
Mol. Mass.:
625.5091
SMILES:
Fc1ccc(C(=O)N[C@H](Cc2ccccc2F)C(=O)N[C@@H]2CCc3c(F)c(F)cc(F)c3N(C3CC3)C2=O)c(c1)C(F)(F)F
: