Target
Sodium channel protein type 9 subunit alpha
Ligand
BDBM50491994
Substrate
Meas. Tech.
ChEMBL_964984 (CHEMBL2396017)
IC50
494±n/a nM
Citation
 Hoyt, SBLondon, CAbbadie, CFelix, JPGarcia, MLJochnowitz, NKaranam, BVLi, XLyons, KAMcGowan, EPriest, BTSmith, MMWarren, VAThomas-Fowlkes, BSKaczorowski, GJDuffy, JL A novel benzazepinone sodium channel blocker with oral efficacy in a rat model of neuropathic pain. Bioorg Med Chem Lett 23:3640-5 (2013)  
Target
Name:
Sodium channel protein type 9 subunit alpha
Synonyms:
NENA Peripheral sodium channel 1 SCN9A_HUMAN Voltage-gated sodium channel subunit Nav1.7 hNE-Na
Type:
Protein
Mol. Mass.:
226375.97
Organism:
Homo sapiens (Human)
Description:
Q15858
Residue:
1988
  
Inhibitor
Name:
BDBM50491994
Synonyms:
CHEMBL2391647
Type:
Small organic molecule
Emp. Form.:
C29H33F6N3O5
Mol. Mass.:
617.5798
SMILES:
CC(C)N1c2cc(ccc2CC[C@@H](NC(=O)[C@@H](Cc2ccccc2OC(F)(F)F)NC(=O)OC(C)(C)C)C1=O)C(F)(F)F
: