Target
Sodium channel protein type 9 subunit alpha
Ligand
BDBM50491997
Substrate
Meas. Tech.
ChEMBL_964984 (CHEMBL2396017)
IC50
70±n/a nM
Citation
 Hoyt, SBLondon, CAbbadie, CFelix, JPGarcia, MLJochnowitz, NKaranam, BVLi, XLyons, KAMcGowan, EPriest, BTSmith, MMWarren, VAThomas-Fowlkes, BSKaczorowski, GJDuffy, JL A novel benzazepinone sodium channel blocker with oral efficacy in a rat model of neuropathic pain. Bioorg Med Chem Lett 23:3640-5 (2013)  
Target
Name:
Sodium channel protein type 9 subunit alpha
Synonyms:
NENA Peripheral sodium channel 1 SCN9A_HUMAN Voltage-gated sodium channel subunit Nav1.7 hNE-Na
Type:
Protein
Mol. Mass.:
226375.97
Organism:
Homo sapiens (Human)
Description:
Q15858
Residue:
1988
  
Inhibitor
Name:
BDBM50491997
Synonyms:
CHEMBL2391643
Type:
Small organic molecule
Emp. Form.:
C28H33F4N3O5
Mol. Mass.:
567.5723
SMILES:
CC(C)N1c2c(F)cccc2CC[C@@H](NC(=O)[C@@H](Cc2ccccc2OC(F)(F)F)NC(=O)OC(C)(C)C)C1=O
: