Target
Prostaglandin G/H synthase 1
Ligand
BDBM50492034
Substrate
Meas. Tech.
ChEMBL_963754 (CHEMBL2395753)
IC50
71400±n/a nM
Citation
 Battilocchio, CPoce, GAlfonso, SPorretta, GCConsalvi, SSautebin, LPace, SRossi, AGhelardini, CDi Cesare Mannelli, LSchenone, SGiordani, ADi Francesco, LPatrignani, PBiava, M A class of pyrrole derivatives endowed with analgesic/anti-inflammatory activity. Bioorg Med Chem 21:3695-701 (2013)  
Target
Name:
Prostaglandin G/H synthase 1
Synonyms:
COX-1 Cyclooxygenase Cyclooxygenase-1 (COX-1) PTGS1 | Prostaglandin G/H synthase (cyclooxygenase)
Type:
Enzyme
Mol. Mass.:
68692.62
Organism:
Homo sapiens (Human)
Description:
P23219
Residue:
599
  
Inhibitor
Name:
BDBM50492034
Synonyms:
CHEMBL2391048
Type:
Small organic molecule
Emp. Form.:
C19H15F2NO3S
Mol. Mass.:
375.389
SMILES:
Cc1c(C=O)cc(-c2ccc(cc2)S(C)(=O)=O)n1-c1ccc(F)c(F)c1
: