Target
Prostaglandin G/H synthase 1
Ligand
BDBM50492036
Substrate
Meas. Tech.
ChEMBL_963765 (CHEMBL2395764)
IC50
>10000±n/a nM
Citation
 Battilocchio, CPoce, GAlfonso, SPorretta, GCConsalvi, SSautebin, LPace, SRossi, AGhelardini, CDi Cesare Mannelli, LSchenone, SGiordani, ADi Francesco, LPatrignani, PBiava, M A class of pyrrole derivatives endowed with analgesic/anti-inflammatory activity. Bioorg Med Chem 21:3695-701 (2013)  
Target
Name:
Prostaglandin G/H synthase 1
Synonyms:
Cox-1 Cyclooxygenase-1 PGH1_MOUSE PHS 1 Prostaglandin H2 synthase 1 Ptgs1
Type:
PROTEIN
Mol. Mass.:
69044.61
Organism:
Mus musculus
Description:
ChEMBL_10575
Residue:
602
  
Inhibitor
Name:
BDBM50492036
Synonyms:
CHEMBL2391056
Type:
Small organic molecule
Emp. Form.:
C19H16N2O2S
Mol. Mass.:
336.408
SMILES:
Cc1c(cc(-c2ccc(cc2)S(C)(=O)=O)n1-c1ccccc1)C#N
: