Target
Prostaglandin G/H synthase 1
Ligand
BDBM50492034
Substrate
Meas. Tech.
ChEMBL_963765 (CHEMBL2395764)
IC50
>10000±n/a nM
Citation
 Battilocchio, CPoce, GAlfonso, SPorretta, GCConsalvi, SSautebin, LPace, SRossi, AGhelardini, CDi Cesare Mannelli, LSchenone, SGiordani, ADi Francesco, LPatrignani, PBiava, M A class of pyrrole derivatives endowed with analgesic/anti-inflammatory activity. Bioorg Med Chem 21:3695-701 (2013)  
Target
Name:
Prostaglandin G/H synthase 1
Synonyms:
Cox-1 Cyclooxygenase-1 PGH1_MOUSE PHS 1 Prostaglandin H2 synthase 1 Ptgs1
Type:
PROTEIN
Mol. Mass.:
69044.61
Organism:
Mus musculus
Description:
ChEMBL_10575
Residue:
602
  
Inhibitor
Name:
BDBM50492034
Synonyms:
CHEMBL2391048
Type:
Small organic molecule
Emp. Form.:
C19H15F2NO3S
Mol. Mass.:
375.389
SMILES:
Cc1c(C=O)cc(-c2ccc(cc2)S(C)(=O)=O)n1-c1ccc(F)c(F)c1
: