Target
Muscarinic acetylcholine receptor M1
Ligand
BDBM50492269
Substrate
Meas. Tech.
ChEMBL_967154 (CHEMBL2400143)
EC50
1.8±n/a nM
Citation
 Mistry, SNValant, CSexton, PMCapuano, BChristopoulos, AScammells, PJ Synthesis and pharmacological profiling of analogues of benzyl quinolone carboxylic acid (BQCA) as allosteric modulators of the M1 muscarinic receptor. J Med Chem 56:5151-72 (2013)  
Target
Name:
Muscarinic acetylcholine receptor M1
Synonyms:
ACM1_HUMAN Cholinergic receptor, muscarinic 1 | Cholinergic, muscarinic M1
Type:
Protein
Mol. Mass.:
51442.54
Organism:
Homo sapiens (Human)
Description:
P11229
Residue:
460
  
Inhibitor
Name:
BDBM50492269
Synonyms:
CHEMBL594432
Type:
Small organic molecule
Emp. Form.:
C18H13F2NO4
Mol. Mass.:
345.2969
SMILES:
COc1ccc(Cn2cc(C(O)=O)c(=O)c3c(F)ccc(F)c23)cc1
: