Target
Mu-type opioid receptor
Ligand
BDBM50492548
Substrate
Meas. Tech.
ChEMBL_972711 (CHEMBL2410920)
Ki
21±n/a nM
Citation
 Lesma, GSalvadori, SAiraghi, FMurray, TFRecca, TSacchetti, ABalboni, GSilvani, A Structural and biological exploration of phe(3)-phe(4)-modified endomorphin-2 peptidomimetics. ACS Med Chem Lett 4:795-9 (2013)  
Target
Name:
Mu-type opioid receptor
Synonyms:
M-OR-1 MOR-1 MUOR1 Mu opiate receptor OPRM1 hMOP | mu-type opioid receptor isoform MOR-1
Type:
G Protein-Coupled Receptor (GPCR)
Mol. Mass.:
44789.51
Organism:
Homo sapiens (Human)
Description:
P35372
Residue:
400
  
Inhibitor
Name:
BDBM50492548
Synonyms:
CHEMBL2409033
Type:
Small organic molecule
Emp. Form.:
C37H42F3N5O7
Mol. Mass.:
725.7539
SMILES:
OC(=O)C(F)(F)F.N[C@@H](Cc1ccc(O)cc1)C(=O)N1CCC[C@H]1C(=O)N[C@H](CC(=O)N1C[C@@H](Cc2ccccc2C1)C(N)=O)Cc1ccccc1
: