Target
Delta-type opioid receptor
Ligand
BDBM50492547
Substrate
Meas. Tech.
ChEMBL_972710 (CHEMBL2410919)
Ki
463±n/a nM
Citation
 Lesma, GSalvadori, SAiraghi, FMurray, TFRecca, TSacchetti, ABalboni, GSilvani, A Structural and biological exploration of phe(3)-phe(4)-modified endomorphin-2 peptidomimetics. ACS Med Chem Lett 4:795-9 (2013)  
Target
Name:
Delta-type opioid receptor
Synonyms:
D-OR-1 Delta opioid receptor OPIATE Delta OPRD1 OPRK1 | opioid receptor, delta 1
Type:
G Protein-Coupled Receptor (GPCR)
Mol. Mass.:
40382.98
Organism:
Homo sapiens (Human)
Description:
Competition binding assays were carried out using membrane preparations from transfected HN9.10 cells that constitutively expressed the delta opioid receptor.
Residue:
372
  
Inhibitor
Name:
BDBM50492547
Synonyms:
CHEMBL2409169
Type:
Small organic molecule
Emp. Form.:
C36H42F3N5O7
Mol. Mass.:
713.7432
SMILES:
OC(=O)C(F)(F)F.N[C@@H](Cc1ccc(O)cc1)C(=O)N1CCC[C@H]1C(=O)N[C@H](CC(=O)NC[C@H](Cc1ccccc1)C(N)=O)Cc1ccccc1
: