Target
Sterol O-acyltransferase 1
Ligand
BDBM50028877
Substrate
Meas. Tech.
ChEMBL_28495 (CHEMBL645925)
IC50
7500±n/a nM
Citation
 Burnett, DACaplen, MADavis, HRBurrier, REClader, JW 2-Azetidinones as inhibitors of cholesterol absorption. J Med Chem 37:1733-6 (1994)  
Target
Name:
Sterol O-acyltransferase 1
Synonyms:
ACAT-1 Acat SOAT1_RAT Sterol O-acyltransferase, Soat
Type:
PROTEIN
Mol. Mass.:
64165.56
Organism:
Rattus norvegicus
Description:
ChEMBL_28796
Residue:
545
  
Inhibitor
Name:
BDBM50028877
Synonyms:
(3S,4R)-1-(4-Methoxy-phenyl)-3,4-diphenyl-3-phenylacetyl-azetidin-2-one | CHEMBL49273
Type:
Small organic molecule
Emp. Form.:
C30H25NO3
Mol. Mass.:
447.5244
SMILES:
COc1ccc(cc1)N1[C@H](c2ccccc2)[C@@](C(=O)Cc2ccccc2)(C1=O)c1ccccc1
: