Target
Sterol O-acyltransferase 1
Ligand
BDBM50028867
Substrate
Meas. Tech.
ChEMBL_28511 (CHEMBL642850)
IC50
11000±n/a nM
Citation
 Burnett, DACaplen, MADavis, HRBurrier, REClader, JW 2-Azetidinones as inhibitors of cholesterol absorption. J Med Chem 37:1733-6 (1994)  
Target
Name:
Sterol O-acyltransferase 1
Synonyms:
ACAT-1 Acat SOAT1_RAT Sterol O-acyltransferase, Soat
Type:
PROTEIN
Mol. Mass.:
64165.56
Organism:
Rattus norvegicus
Description:
ChEMBL_28796
Residue:
545
  
Inhibitor
Name:
BDBM50028867
Synonyms:
(3R,4S)-1,4-Bis-(4-methoxy-phenyl)-3-(3-phenyl-propyl)-azetidin-2-one SCH-47949 | SCH-48461
Type:
Small organic molecule
Emp. Form.:
C26H27NO3
Mol. Mass.:
401.4975
SMILES:
COc1ccc(cc1)[C@@H]1[C@@H](CCCc2ccccc2)C(=O)N1c1ccc(OC)cc1
: