Target
5-hydroxytryptamine receptor 2C
Ligand
BDBM50038691
Substrate
Meas. Tech.
ChEMBL_2842 (CHEMBL621527)
Ki
840±n/a nM
Citation
 Glennon, RADukat, Mel-Bermawy, MLaw, HDe los Angeles, JTeitler, MKing, AHerrick-Davis, K Influence of amine substituents on 5-HT2A versus 5-HT2C binding of phenylalkyl- and indolylalkylamines. J Med Chem 37:1929-35 (1994)  
Target
Name:
5-hydroxytryptamine receptor 2C
Synonyms:
5-HT2C 5-hydroxytryptamine receptor 2C (5HT2c) 5ht1c Htr2c Serotonin receptor 2a and 2c (5HT2A and 5HT2C)
Type:
Enzyme
Mol. Mass.:
51935.10
Organism:
Rattus norvegicus (Rat)
Description:
P08909
Residue:
460
  
Inhibitor
Name:
BDBM50038691
Synonyms:
CHEMBL58579 | [2-(5-Methoxy-1H-indol-3-yl)-ethyl]-methyl-amine
Type:
Small organic molecule
Emp. Form.:
C12H16N2O
Mol. Mass.:
204.2682
SMILES:
CNCCc1c[nH]c2ccc(OC)cc12
: