Target
Urease subunit beta
Ligand
BDBM50493380
Substrate
Meas. Tech.
ChEMBL_981270 (CHEMBL2427755)
Ki
14±n/a nM
Citation
 Xiao, ZPPeng, ZYDong, JJDeng, RCWang, XDOuyang, HYang, PHe, JWang, YFZhu, MPeng, XCPeng, WXZhu, HL Synthesis, molecular docking and kinetic properties of ?-hydroxy-?-phenylpropionyl-hydroxamic acids as Helicobacter pylori urease inhibitors. Eur J Med Chem 68:212-21 (2013)  
Target
Name:
Urease subunit beta
Synonyms:
3.5.1.5 Urea amidohydrolase subunit beta hpuB | ureB
Type:
PROTEIN
Mol. Mass.:
61676.43
Organism:
Helicobacter pylori (strain ATCC 700392 / 26695) (Campylobacterpylori)
Description:
ChEMBL_117195
Residue:
569
  
Inhibitor
Name:
BDBM50493380
Synonyms:
CHEMBL2425469
Type:
Small organic molecule
Emp. Form.:
C9H10ClNO3
Mol. Mass.:
215.634
SMILES:
ONC(=O)CC(O)c1cccc(Cl)c1
: