Target
Urease subunit beta
Ligand
BDBM50099857
Substrate
Meas. Tech.
ChEMBL_981464 (CHEMBL2428642)
IC50
27600±n/a nM
Citation
 Xiao, ZPPeng, ZYDong, JJDeng, RCWang, XDOuyang, HYang, PHe, JWang, YFZhu, MPeng, XCPeng, WXZhu, HL Synthesis, molecular docking and kinetic properties of ?-hydroxy-?-phenylpropionyl-hydroxamic acids as Helicobacter pylori urease inhibitors. Eur J Med Chem 68:212-21 (2013)  
Target
Name:
Urease subunit beta
Synonyms:
3.5.1.5 Urea amidohydrolase subunit beta hpuB | ureB
Type:
PROTEIN
Mol. Mass.:
61676.43
Organism:
Helicobacter pylori (strain ATCC 700392 / 26695) (Campylobacterpylori)
Description:
ChEMBL_117195
Residue:
569
  
Inhibitor
Name:
BDBM50099857
Synonyms:
ACETOHYDROXAMIC ACID (AHA) Acethydroxamsaeure Acetic acid, oxime Cetohyroxamic acid Methylhydroxamic acid N-Acetylhydroxylamine acetohydroxamic acid
Type:
Small organic molecule
Emp. Form.:
C2H5NO2
Mol. Mass.:
75.0666
SMILES:
CC(=O)NO
: