Target
Sterol 14-alpha demethylase
Ligand
BDBM50493561
Substrate
Meas. Tech.
ChEMBL_984872 (CHEMBL2432695)
Kd
<5.0±n/a nM
Citation
 Choi, JYCalvet, CMGunatilleke, SSRuiz, CCameron, MDMcKerrow, JHPodust, LMRoush, WR Rational development of 4-aminopyridyl-based inhibitors targeting Trypanosoma cruzi CYP51 as anti-chagas agents. J Med Chem 56:7651-68 (2013)  
Target
Name:
Sterol 14-alpha demethylase
Synonyms:
CP51_TRYCC Cytochrome P450 51 Sterol 14α-demethylase (CYP51) Sterol 14-alpha demethylase (CYP51) | Tc14DM
Type:
Protein
Mol. Mass.:
54690.12
Organism:
Trypanosoma cruzi
Description:
Q7Z1V1
Residue:
481
  
Inhibitor
Name:
BDBM50493561
Synonyms:
CHEMBL2431534
Type:
Small organic molecule
Emp. Form.:
C36H28F2N4O3
Mol. Mass.:
602.6293
SMILES:
Fc1cc(ccc1OCc1ccccc1)-c1ccc(C(=O)N[C@@H](Cc2c[nH]c3ccccc23)C(=O)Nc2ccncc2)c(F)c1
: