Target
Sterol 14-alpha demethylase
Ligand
BDBM50493563
Substrate
Meas. Tech.
ChEMBL_984872 (CHEMBL2432695)
Kd
<5.0±n/a nM
Citation
 Choi, JYCalvet, CMGunatilleke, SSRuiz, CCameron, MDMcKerrow, JHPodust, LMRoush, WR Rational development of 4-aminopyridyl-based inhibitors targeting Trypanosoma cruzi CYP51 as anti-chagas agents. J Med Chem 56:7651-68 (2013)  
Target
Name:
Sterol 14-alpha demethylase
Synonyms:
CP51_TRYCC Cytochrome P450 51 Sterol 14α-demethylase (CYP51) Sterol 14-alpha demethylase (CYP51) | Tc14DM
Type:
Protein
Mol. Mass.:
54690.12
Organism:
Trypanosoma cruzi
Description:
Q7Z1V1
Residue:
481
  
Inhibitor
Name:
BDBM50493563
Synonyms:
CHEMBL2429885
Type:
Small organic molecule
Emp. Form.:
C29H24N4O2
Mol. Mass.:
460.5265
SMILES:
O=C(Nc1ccncc1)[C@H](Cc1c[nH]c2ccccc12)NC(=O)c1ccc(cc1)-c1ccccc1
: