Target
Adenosine receptor A1
Ligand
BDBM50040049
Substrate
Meas. Tech.
ChEMBL_29109 (CHEMBL638721)
Ki
14000±n/a nM
Citation
 Franchetti, PMessini, LCappellacci, LGrifantini, MLucacchini, AMartini, CSenatore, G 8-Azaxanthine derivatives as antagonists of adenosine receptors. J Med Chem 37:2970-5 (1994)  
Target
Name:
Adenosine receptor A1
Synonyms:
AA1R_BOVIN ADENOSINE A1 high ADORA1 | Adenosine A1 receptor
Type:
Enzyme Catalytic Domain
Mol. Mass.:
36602.99
Organism:
BOVINE
Description:
ADENOSINE 0 BOVINE::P28190
Residue:
326
  
Inhibitor
Name:
BDBM50040049
Synonyms:
1-(2-Amino-4-chloro-phenyl)-4,6-dimethyl-1,4-dihydro-[1,2,3]triazolo[4,5-d]pyrimidine-5,7-dione | CHEMBL328812
Type:
Small organic molecule
Emp. Form.:
C12H11ClN6O2
Mol. Mass.:
306.708
SMILES:
Cn1c2nnn(-c3ccc(Cl)cc3N)c2c(=O)n(C)c1=O
: