Target
Adenosine receptor A2a
Ligand
BDBM50040052
Substrate
Meas. Tech.
ChEMBL_27618 (CHEMBL639494)
Ki
10000±n/a nM
Citation
 Franchetti, PMessini, LCappellacci, LGrifantini, MLucacchini, AMartini, CSenatore, G 8-Azaxanthine derivatives as antagonists of adenosine receptors. J Med Chem 37:2970-5 (1994)  
Target
Name:
Adenosine receptor A2a
Synonyms:
A2A adenosine receptor (hA2A) ADENOSINE A2 ADORA2 Adenosine A2A receptor (A2AAR)
Type:
G Protein-Coupled Receptor (GPCR)
Mol. Mass.:
44716.46
Organism:
Homo sapiens (Human)
Description:
P29274
Residue:
412
  
Inhibitor
Name:
BDBM50040052
Synonyms:
1-Cyclopentyl-4,6-dipropyl-1,4-dihydro-[1,2,3]triazolo[4,5-d]pyrimidine-5,7-dione | CHEMBL100346
Type:
Small organic molecule
Emp. Form.:
C15H23N5O2
Mol. Mass.:
305.3754
SMILES:
CCCn1c2nnn(C3CCCC3)c2c(=O)n(CCC)c1=O
: