Target
Adenosine receptor A1
Ligand
BDBM50040056
Substrate
Meas. Tech.
ChEMBL_29109 (CHEMBL638721)
Ki
1100±n/a nM
Citation
 Franchetti, PMessini, LCappellacci, LGrifantini, MLucacchini, AMartini, CSenatore, G 8-Azaxanthine derivatives as antagonists of adenosine receptors. J Med Chem 37:2970-5 (1994)  
Target
Name:
Adenosine receptor A1
Synonyms:
AA1R_BOVIN ADENOSINE A1 high ADORA1 | Adenosine A1 receptor
Type:
Enzyme Catalytic Domain
Mol. Mass.:
36602.99
Organism:
BOVINE
Description:
ADENOSINE 0 BOVINE::P28190
Residue:
326
  
Inhibitor
Name:
BDBM50040056
Synonyms:
1-Cyclohexyl-4,6-dipropyl-1,4-dihydro-[1,2,3]triazolo[4,5-d]pyrimidine-5,7-dione | CHEMBL101554
Type:
Small organic molecule
Emp. Form.:
C16H25N5O2
Mol. Mass.:
319.402
SMILES:
CCCn1c2nnn(C3CCCCC3)c2c(=O)n(CCC)c1=O
: