Target
Carbonic anhydrase 13
Ligand
BDBM50380140
Substrate
Meas. Tech.
ChEMBL_989825 (CHEMBL2446501)
Kd
333±n/a nM
Citation
 ?apkauskait?, EZubrien?, ASmirnov, ATorresan, JKi?onait?, MKazokait?, JGylyt?, JMichailovien?, VJogait?, VManakova, EGra?ulis, STumkevi?ius, SMatulis, D Benzenesulfonamides with pyrimidine moiety as inhibitors of human carbonic anhydrases I, II, VI, VII, XII, and XIII. Bioorg Med Chem 21:6937-47 (2013)  
Target
Name:
Carbonic anhydrase 13
Synonyms:
CA13 Carbonic anhydrase Carbonic anhydrase XIII (CA XIII)
Type:
Enzyme
Mol. Mass.:
29445.78
Organism:
Homo sapiens (Human)
Description:
Q8N1Q1
Residue:
262
  
Inhibitor
Name:
BDBM50380140
Synonyms:
CHEMBL2011155 | carbonic anhydrase (CA) inhibitors, benzenesulphonamide ligand, 10
Type:
Small organic molecule
Emp. Form.:
C12H10ClN3O3S2
Mol. Mass.:
343.809
SMILES:
NS(=O)(=O)c1cc(ccc1Cl)C(=O)CSc1ncccn1
: