Target
Adenosine receptor A1
Ligand
BDBM50040345
Substrate
Meas. Tech.
ChEMBL_28668 (CHEMBL649066)
IC50
1500±n/a nM
Citation
 Buckle, DRArch, JRConnolly, BJFenwick, AEFoster, KAMurray, KJReadshaw, SASmallridge, MSmith, DG Inhibition of cyclic nucleotide phosphodiesterase by derivatives of 1,3-bis(cyclopropylmethyl)xanthine. J Med Chem 37:476-85 (1994)  
Target
Name:
Adenosine receptor A1
Synonyms:
AA1R_RAT ADENOSINE A1 high Adenosine A1 receptor (A1) Adenosine receptors A1 | Adora1
Type:
Protein
Mol. Mass.:
36704.13
Organism:
Rattus norvegicus (rat)
Description:
Residue:
326
  
Inhibitor
Name:
BDBM50040345
Synonyms:
CHEMBL146165 | N-(1,3-Bis-cyclopropylmethyl-2,6-dioxo-2,3,6,7-tetrahydro-1H-purin-8-yl)-4-methoxy-benzenesulfonamide
Type:
Small organic molecule
Emp. Form.:
C20H23N5O5S
Mol. Mass.:
445.492
SMILES:
COc1ccc(cc1)S(=O)(=O)Nc1nc2n(CC3CC3)c(=O)n(CC3CC3)c(=O)c2[nH]1
: