Target
Cannabinoid receptor 2
Ligand
BDBM50494420
Substrate
Meas. Tech.
ChEMBL_1276776 (CHEMBL3089351)
IC50
224±n/a nM
Citation
 Dossou, KSDevkota, KPMorton, CEgan, JMLu, GBeutler, JAMoaddel, R Identification of CB1/CB2 ligands from Zanthoxylum bungeanum. J Nat Prod 76:2060-4 (2013)  
Target
Name:
Cannabinoid receptor 2
Synonyms:
CANNABINOID CB2 CB2 CB2B CNR2_HUMAN Cannabinoid CB2 receptor Cannabinoid receptor 2 (CB2R) | hCB2
Type:
G Protein-Coupled Receptor (GPCR)
Mol. Mass.:
39690.94
Organism:
Homo sapiens (Human)
Description:
P34972
Residue:
360
  
Inhibitor
Name:
BDBM50494420
Synonyms:
CHEMBL3086845
Type:
Small organic molecule
Emp. Form.:
C18H27NO2
Mol. Mass.:
289.4125
SMILES:
C\C=C\C=C\C=C\CC\C=C\C=C\C(=O)NCC(C)(C)O
: