Target
Cannabinoid receptor 1
Ligand
BDBM50494422
Substrate
Meas. Tech.
ChEMBL_1276778 (CHEMBL3089353)
IC50
41±n/a nM
Citation
 Dossou, KSDevkota, KPMorton, CEgan, JMLu, GBeutler, JAMoaddel, R Identification of CB1/CB2 ligands from Zanthoxylum bungeanum. J Nat Prod 76:2060-4 (2013)  
Target
Name:
Cannabinoid receptor 1
Synonyms:
CANN6 CB-R CNR CNR1_HUMAN Cannabinoid receptor Cannabinoid receptor 1 (brain)
Type:
G Protein-Coupled Receptor (GPCR)
Mol. Mass.:
52868.96
Organism:
Homo sapiens (Human)
Description:
P21554
Residue:
472
  
Inhibitor
Name:
BDBM50494422
Synonyms:
CHEMBL3086847
Type:
Small organic molecule
Emp. Form.:
C16H25NO3
Mol. Mass.:
279.3746
SMILES:
C\C=C\C=C\C=C/CC\C=C\C(=O)NCC(C)(O)CO
: