Target
Proto-oncogene tyrosine-protein kinase Src
Ligand
BDBM50040913
Substrate
Meas. Tech.
ChEMBL_216999 (CHEMBL821534)
IC50
>50000±n/a nM
Citation
 Trinks, UBuchdunger, EFuret, PKump, WMett, HMeyer, TMüller, MRegenass, URihs, GLydon, N Dianilinophthalimides: potent and selective, ATP-competitive inhibitors of the EGF-receptor protein tyrosine kinase. J Med Chem 37:1015-27 (1994)  
Target
Name:
Proto-oncogene tyrosine-protein kinase Src
Synonyms:
Calmodulin/Proto-oncogene tyrosine-protein kinase Src Proto-oncogene c-Src SRC SRC_HUMAN V-src sarcoma (Schmidt-Ruppin A-2) viral oncogene homolog (avian) p60-Src | pp60c-src
Type:
Protein
Mol. Mass.:
59838.60
Organism:
Homo sapiens (Human)
Description:
P12931
Residue:
536
  
Inhibitor
Name:
BDBM50040913
Synonyms:
1,4-Diphenyl-1,2,3,4-tetrahydro-pyrrolo[3,4-g]quinoxaline-6,8-dione | CHEMBL266255
Type:
Small organic molecule
Emp. Form.:
C22H17N3O2
Mol. Mass.:
355.3893
SMILES:
O=C1NC(=O)c2cc3N(CCN(c4ccccc4)c3cc12)c1ccccc1
: