Target
Tyrosine-protein kinase ABL1/ABL2
Ligand
BDBM50040913
Substrate
Meas. Tech.
ChEMBL_226209 (CHEMBL844139)
IC50
>50000±n/a nM
Citation
 Trinks, UBuchdunger, EFuret, PKump, WMett, HMeyer, TMüller, MRegenass, URihs, GLydon, N Dianilinophthalimides: potent and selective, ATP-competitive inhibitors of the EGF-receptor protein tyrosine kinase. J Med Chem 37:1015-27 (1994)  
Target
Name:
Tyrosine-protein kinase ABL1/ABL2
Synonyms:
Tyrosine-protein kinase ABL
Type:
Mol. Mass.:
Description:
ASSAY_ID of EBI is 226000
Components:
This complex has 2 components.
Component 1
Name:
Tyrosine-protein kinase ABL1
Synonyms:
ABL ABL1_HUMAN JTK7 Proto-oncogene tyrosine-protein kinase ABL1 Tyrosine-protein kinase ABL V-abl Abelson murine leukemia viral oncogene homolog 1 p150 | tyrosine-protein kinase ABL1 isoform a
Type:
Enzyme
Mol. Mass.:
122897.30
Organism:
Homo sapiens (Human)
Description:
P00519
Residue:
1130
  
Component 2
Name:
Tyrosine-protein kinase ABL2
Synonyms:
ABL2 ABLL Abelson murine leukemia viral oncogene homolog 2 Tyrosine kinase ARG | VHL/Tyrosine-protein kinase ABL2
Type:
PROTEIN
Mol. Mass.:
128360.63
Organism:
Homo sapiens (Human)
Description:
ChEMBL_325082
Residue:
1182
  
Inhibitor
Name:
BDBM50040913
Synonyms:
1,4-Diphenyl-1,2,3,4-tetrahydro-pyrrolo[3,4-g]quinoxaline-6,8-dione | CHEMBL266255
Type:
Small organic molecule
Emp. Form.:
C22H17N3O2
Mol. Mass.:
355.3893
SMILES:
O=C1NC(=O)c2cc3N(CCN(c4ccccc4)c3cc12)c1ccccc1
: