Target
Epidermal growth factor receptor
Ligand
BDBM50040915
Substrate
Meas. Tech.
ChEMBL_66568 (CHEMBL679549)
IC50
>50000±n/a nM
Citation
 Trinks, UBuchdunger, EFuret, PKump, WMett, HMeyer, TMüller, MRegenass, URihs, GLydon, N Dianilinophthalimides: potent and selective, ATP-competitive inhibitors of the EGF-receptor protein tyrosine kinase. J Med Chem 37:1015-27 (1994)  
Target
Name:
Epidermal growth factor receptor
Synonyms:
EGF Receptor Substrate EGFR_HUMAN ERBB1 Epidermal Growth Factor Receptor erbB-1 Epidermal growth factor receptor (EGFR) HER1 Proto-oncogene c-ErbB-1 Tyrosine-Protein Kinase ErbB-1
Type:
Receptor Kinase Domain
Mol. Mass.:
134279.59
Organism:
Homo sapiens (Human)
Description:
P00533
Residue:
1210
  
Inhibitor
Name:
BDBM50040915
Synonyms:
5,6-Bis-(4-iodo-phenylamino)-isoindole-1,3-dione | CHEMBL8163
Type:
Small organic molecule
Emp. Form.:
C20H13I2N3O2
Mol. Mass.:
581.1451
SMILES:
Ic1ccc(Nc2cc3C(=O)NC(=O)c3cc2Nc2ccc(I)cc2)cc1
: