Target
Cyclin-dependent kinase 4/G1/S-specific cyclin-D3
Ligand
BDBM444532
Substrate
Meas. Tech.
ChEMBL_1806445 (CHEMBL4305804)
IC50
1.9±n/a nM
Citation
 Shi, CWang, QLiao, XGe, HHuo, GZhang, LChen, NZhai, XHong, YWang, LHan, YXiao, WWang, ZShi, WMao, YYu, JXia, GLiu, Y Discovery of 6-(2-(dimethylamino)ethyl)-N-(5-fluoro-4-(4-fluoro-1-isopropyl-2-methyl-1H-benzo[d]imidazole-6-yl)pyrimidin-2-yl)-5,6,7,8-tetrahydro-1,6-naphthyridin-2-amine as a highly potent cyclin-dependent kinase 4/6 inhibitor for treatment of cancer. Eur J Med Chem 178:352-364 (2019)  
Target
Name:
Cyclin-dependent kinase 4/G1/S-specific cyclin-D3
Synonyms:
CDK4/Cyclin D3
Type:
Mol. Mass.:
Description:
ASSAY_ID of ChEMBL is 1806445
Components:
This complex has 2 components.
Component 1
Name:
Cyclin-dependent kinase 4
Synonyms:
CDK4 Cell division protein kinase 4 PSK-J3
Type:
Enzyme Subunit
Mol. Mass.:
33731.96
Organism:
Homo sapiens (Human)
Description:
P11802
Residue:
303
  
Component 2
Name:
G1/S-specific cyclin-D3
Synonyms:
CCND3 | CCND3_HUMAN
Type:
Enzyme
Mol. Mass.:
32521.90
Organism:
Homo sapiens (Human)
Description:
P30281
Residue:
292
  
Inhibitor
Name:
BDBM444532
Synonyms:
US10662186, Compound 52 | US10988476, Compound I-52
Type:
Small organic molecule
Emp. Form.:
C27H30F2N8
Mol. Mass.:
504.5775
SMILES:
CN(C)CCN1CCc2nc(Nc3ncc(F)c(n3)-c3cc(F)c4nc(C)n(C5CC5)c4c3)ccc2C1
: