Target
Phospholipase A2, major isoenzyme
Ligand
BDBM50031087
Substrate
Meas. Tech.
ChEMBL_156356 (CHEMBL761686)
IC50
>25000±n/a nM
Citation
 Wilkerson, WWGalbraith, WGans-Brangs, KGrubb, MHewes, WEJaffee, BKenney, JPKerr, JWong, N Antiinflammatory 4,5-diarylpyrroles: synthesis and QSAR. J Med Chem 37:988-98 (1994)  
Target
Name:
Phospholipase A2, major isoenzyme
Synonyms:
Group IB phospholipase A2 PLA2G1B Phospholipase A2
Type:
Hydrolase; monomer or homodimer
Mol. Mass.:
16279.83
Organism:
Sus scrofa (pig)
Description:
Purchased from Sigma.
Residue:
146
  
Inhibitor
Name:
BDBM50031087
Synonyms:
3-(4-Fluoro-phenyl)-2-(4-methanesulfonyl-phenyl)-5-thiocyanato-1H-pyrrole | CHEMBL126345
Type:
Small organic molecule
Emp. Form.:
C18H13FN2O2S2
Mol. Mass.:
372.436
SMILES:
CS(=O)(=O)c1ccc(cc1)-c1[nH]c(SC#N)cc1-c1ccc(F)cc1
: