Target
Tubulin beta-2B chain
Ligand
BDBM50041104
Substrate
Meas. Tech.
ChEMBL_211333 (CHEMBL820776)
IC50
>40000±n/a nM
Citation
 Li, LWang, HKKuo, SCWu, TSLednicer, DLin, CMHamel, ELee, KH Antitumor agents. 150. 2',3',4',5',5,6,7-substituted 2-phenyl-4-quinolones and related compounds: their synthesis, cytotoxicity, and inhibition of tubulin polymerization. J Med Chem 37:1126-35 (1994)  
Target
Name:
Tubulin beta-2B chain
Synonyms:
TBB2B_BOVIN Tubulin | Tubulin beta chain
Type:
PROTEIN
Mol. Mass.:
49932.38
Organism:
Bos taurus
Description:
ChEMBL_211651
Residue:
445
  
Inhibitor
Name:
BDBM50041104
Synonyms:
6-Methoxy-2-pyridin-2-yl-1H-quinolin-4-one | CHEMBL14775
Type:
Small organic molecule
Emp. Form.:
C15H12N2O2
Mol. Mass.:
252.268
SMILES:
COc1ccc2nc(cc(O)c2c1)-c1ccccn1
: