Target
Tubulin beta-2B chain
Ligand
BDBM50041120
Substrate
Meas. Tech.
ChEMBL_211333 (CHEMBL820776)
IC50
4300±n/a nM
Citation
 Li, LWang, HKKuo, SCWu, TSLednicer, DLin, CMHamel, ELee, KH Antitumor agents. 150. 2',3',4',5',5,6,7-substituted 2-phenyl-4-quinolones and related compounds: their synthesis, cytotoxicity, and inhibition of tubulin polymerization. J Med Chem 37:1126-35 (1994)  
Target
Name:
Tubulin beta-2B chain
Synonyms:
TBB2B_BOVIN Tubulin | Tubulin beta chain
Type:
PROTEIN
Mol. Mass.:
49932.38
Organism:
Bos taurus
Description:
ChEMBL_211651
Residue:
445
  
Inhibitor
Name:
BDBM50041120
Synonyms:
6,7-Dimethoxy-2-(3-methoxy-phenyl)-1H-quinolin-4-one | CHEMBL14337
Type:
Small organic molecule
Emp. Form.:
C18H17NO4
Mol. Mass.:
311.3319
SMILES:
COc1cccc(c1)-c1cc(O)c2cc(OC)c(OC)cc2n1
: