Target
Tubulin beta-2B chain
Ligand
BDBM50041122
Substrate
Meas. Tech.
ChEMBL_211333 (CHEMBL820776)
IC50
>400000±n/a nM
Citation
 Li, LWang, HKKuo, SCWu, TSLednicer, DLin, CMHamel, ELee, KH Antitumor agents. 150. 2',3',4',5',5,6,7-substituted 2-phenyl-4-quinolones and related compounds: their synthesis, cytotoxicity, and inhibition of tubulin polymerization. J Med Chem 37:1126-35 (1994)  
Target
Name:
Tubulin beta-2B chain
Synonyms:
TBB2B_BOVIN Tubulin | Tubulin beta chain
Type:
PROTEIN
Mol. Mass.:
49932.38
Organism:
Bos taurus
Description:
ChEMBL_211651
Residue:
445
  
Inhibitor
Name:
BDBM50041122
Synonyms:
3-Methoxy-6,13-dihydro-5H-9,11-dioxa-13-aza-benzo[a]cyclopenta[i]anthracen-7-one | CHEMBL14750
Type:
Small organic molecule
Emp. Form.:
C19H15NO4
Mol. Mass.:
321.3267
SMILES:
COc1ccc-2c(CCc3c(O)c4cc5OCOc5cc4nc-23)c1
: