Target
Tubulin beta-2B chain
Ligand
BDBM50041135
Substrate
Meas. Tech.
ChEMBL_211333 (CHEMBL820776)
IC50
1500±n/a nM
Citation
 Li, LWang, HKKuo, SCWu, TSLednicer, DLin, CMHamel, ELee, KH Antitumor agents. 150. 2',3',4',5',5,6,7-substituted 2-phenyl-4-quinolones and related compounds: their synthesis, cytotoxicity, and inhibition of tubulin polymerization. J Med Chem 37:1126-35 (1994)  
Target
Name:
Tubulin beta-2B chain
Synonyms:
TBB2B_BOVIN Tubulin | Tubulin beta chain
Type:
PROTEIN
Mol. Mass.:
49932.38
Organism:
Bos taurus
Description:
ChEMBL_211651
Residue:
445
  
Inhibitor
Name:
BDBM50041135
Synonyms:
2-(3-Dimethylamino-phenyl)-1H-quinolin-4-one | CHEMBL14633
Type:
Small organic molecule
Emp. Form.:
C17H16N2O
Mol. Mass.:
264.3217
SMILES:
CN(C)c1cccc(c1)-c1cc(O)c2ccccc2n1
: