Target
Tubulin beta-2B chain
Ligand
BDBM50041137
Substrate
Meas. Tech.
ChEMBL_211333 (CHEMBL820776)
IC50
2300±n/a nM
Citation
 Li, LWang, HKKuo, SCWu, TSLednicer, DLin, CMHamel, ELee, KH Antitumor agents. 150. 2',3',4',5',5,6,7-substituted 2-phenyl-4-quinolones and related compounds: their synthesis, cytotoxicity, and inhibition of tubulin polymerization. J Med Chem 37:1126-35 (1994)  
Target
Name:
Tubulin beta-2B chain
Synonyms:
TBB2B_BOVIN Tubulin | Tubulin beta chain
Type:
PROTEIN
Mol. Mass.:
49932.38
Organism:
Bos taurus
Description:
ChEMBL_211651
Residue:
445
  
Inhibitor
Name:
BDBM50041137
Synonyms:
6-((E)-Styryl)-5H-[1,3]dioxolo[4,5-g]quinolin-8-one | CHEMBL14463
Type:
Small organic molecule
Emp. Form.:
C18H13NO3
Mol. Mass.:
291.3007
SMILES:
Oc1cc(C=Cc2ccccc2)nc2cc3OCOc3cc12
: