Target
Polyphenol oxidase 2
Ligand
BDBM50494897
Substrate
Meas. Tech.
ChEMBL_1277451 (CHEMBL3095774)
Ki
107400±n/a nM
Citation
 Kashima, YMiyazawa, M Synthesis, antioxidant capacity, and structure-activity relationships of tri-O-methylnorbergenin analogues on tyrosinase inhibition. Bioorg Med Chem Lett 23:6580-4 (2013)  
Target
Name:
Polyphenol oxidase 2
Synonyms:
Monophenol monooxygenase PPO2 Tyrosinase
Type:
Protein
Mol. Mass.:
63923.66
Organism:
Agaricus bisporus (Common mushroom)
Description:
O42713
Residue:
556
  
Inhibitor
Name:
BDBM50494897
Synonyms:
CHEMBL3092604
Type:
Small organic molecule
Emp. Form.:
C24H26O12
Mol. Mass.:
506.456
SMILES:
[H][C@]12OC(=O)c3cc(OC)c(OC)c(OC)c3[C@]1([H])O[C@H](COC(=O)c1ccc(OC)c(O)c1)[C@@H](O)[C@@H]2O
: