Target
Reverse transcriptase
Ligand
BDBM50494904
Substrate
Meas. Tech.
ChEMBL_1281575 (CHEMBL3102260)
IC50
6.0±n/a nM
Citation
 Iyidogan, PSullivan, TJChordia, MDFrey, KMAnderson, KS Design, Synthesis, and Antiviral Evaluation of Chimeric Inhibitors of HIV Reverse Transcriptase. ACS Med Chem Lett 4:1183-8 (2013)  
Target
Name:
Reverse transcriptase
Synonyms:
Type:
Protein
Mol. Mass.:
29598.37
Organism:
Human immunodeficiency virus 1
Description:
Q9WKE8
Residue:
254
  
Inhibitor
Name:
BDBM50494904
Synonyms:
CHEMBL3099596
Type:
Small organic molecule
Emp. Form.:
C39H46N7O16P3
Mol. Mass.:
961.7411
SMILES:
Cc1cc(cc(C)c1Oc1ccnc(Nc2ccc(cc2)C#N)n1)C#CCCCCCCCC(=O)NCc1cn([C@H]2C[C@H](O)[C@@H](COP(O)(=O)OP(O)(=O)OP(O)(O)=O)O2)c(=O)[nH]c1=O
: