Target
Inosine-5'-monophosphate dehydrogenase 2
Ligand
BDBM50494912
Substrate
Meas. Tech.
ChEMBL_1283317 (CHEMBL3101582)
Ki
44±n/a nM
Citation
 Felczak, KVince, RPankiewicz, KW NAD-based inhibitors with anticancer potential. Bioorg Med Chem Lett 24:332-6 (2014)  
Target
Name:
Inosine-5'-monophosphate dehydrogenase 2
Synonyms:
IMDH2_HUMAN IMPD 2 IMPDH-II Inosine 5'-monophosphate dehydrogenase II (IMPDH II) Inosine-5 -monophosphate dehydrogenase 2 | Inosine-5'-monophosphate dehydrogenase (IMPDH)
Type:
Enzyme
Mol. Mass.:
55806.87
Organism:
Homo sapiens (Human)
Description:
Recombinant IMPDH2 expressed in E. coli.
Residue:
514
  
Inhibitor
Name:
BDBM50494912
Synonyms:
CHEMBL3098192
Type:
Small organic molecule
Emp. Form.:
C31H37N5O14P2
Mol. Mass.:
765.5981
SMILES:
COc1c(C)c2COC(=O)c2c(O)c1CCOP(O)(=O)CP(O)(=O)OC[C@H]1O[C@H]([C@H](O)[C@@H]1O)n1cnc2c(N)nc(COCc3ccccc3)nc12
: