Target
Prostaglandin G/H synthase 1
Ligand
BDBM13066
Substrate
Meas. Tech.
ChEMBL_1281694 (CHEMBL3100232)
IC50
70±n/a nM
Citation
 Singh, PShaveta, naSharma, SBhatti, R Rationally designed hybrid molecules with appreciable COX-2 inhibitory and anti-nociceptive activities. Bioorg Med Chem Lett 24:77-82 (2014)  
Target
Name:
Prostaglandin G/H synthase 1
Synonyms:
COX1 Cyclooxygenase-1 (COX-1) PTGS1 | Prostaglandin G/H synthase (cyclooxygenase)
Type:
Protein
Mol. Mass.:
68868.60
Organism:
Ovis aries (Sheep)
Description:
Residue:
600
  
Inhibitor
Name:
BDBM13066
Synonyms:
2-{2-[(2,6-dichlorophenyl)amino]phenyl}acetic acid Diclofenac US11478464, Compound Diclofenac {2-[(2,6-dichlorophenyl)amino]phenyl}acetic acid
Type:
Small organic molecule
Emp. Form.:
C14H11Cl2NO2
Mol. Mass.:
296.149
SMILES:
OC(=O)Cc1ccccc1Nc1c(Cl)cccc1Cl
: