Target
Type-1 angiotensin II receptor A/B
Ligand
BDBM50043038
Substrate
Meas. Tech.
ChEMBL_34809 (CHEMBL644585)
IC50
>10000±n/a nM
Citation
 VanAtten, MKEnsinger, CLChiu, ATMcCall, DENguyen, TTWexler, RRTimmermans, PB A novel series of selective, non-peptide inhibitors of angiotensin II binding to the AT2 site. J Med Chem 36:3985-92 (1994)  
Target
Name:
Type-1 angiotensin II receptor A/B
Synonyms:
Angiotensin II receptor (AT-1) type-1 | Type-1A/Type-1B angiotensin II receptor
Type:
Mol. Mass.:
Description:
ASSAY_ID of ChEMBL is 901964
Components:
This complex has 2 components.
Component 1
Name:
Type-1 angiotensin II receptor B
Synonyms:
AGTRB_RAT Agtr1 Angiotensin II AT1B Angiotensin II type 1b (AT-1b) receptor Type-1B angiotensin II receptor
Type:
Enzyme Catalytic Domain
Mol. Mass.:
40929.44
Organism:
RAT
Description:
Angiotensin II AT1B 0 RAT::P29089
Residue:
359
  
Component 2
Name:
Type-1 angiotensin II receptor A
Synonyms:
AGTRA_RAT Agtr1 Angiotensin II AT1 Angiotensin II receptor (AT-1) type-1 Type-1A angiotensin II receptor
Type:
Enzyme Catalytic Domain
Mol. Mass.:
40910.53
Organism:
RAT
Description:
ANGIOTENSIN AT1 AGTR1 RAT::P25095
Residue:
359
  
Inhibitor
Name:
BDBM50043038
Synonyms:
2-Diphenylacetyl-5-(4-methoxy-3-methyl-phenyl)-1,2,3,4-tetrahydro-isoquinoline-3-carboxylic acid | CHEMBL339706
Type:
Small organic molecule
Emp. Form.:
C32H29NO4
Mol. Mass.:
491.577
SMILES:
COc1ccc(cc1C)-c1cccc2CN(C(Cc12)C(O)=O)C(=O)C(c1ccccc1)c1ccccc1
: