Target
Sodium channel protein type 3 subunit alpha
Ligand
BDBM50495860
Substrate
Meas. Tech.
ChEMBL_1289933 (CHEMBL3119944)
IC50
13000±n/a nM
Citation
 Zidar, NJakopin, ?Madge, DJChan, FTytgat, JPeigneur, SDolenc, MSToma?i?, TIla?, JMa?i?, LPKikelj, D Substituted 4-phenyl-2-aminoimidazoles and 4-phenyl-4,5-dihydro-2-aminoimidazoles as voltage-gated sodium channel modulators. Eur J Med Chem 74:23-30 (2014)  
Target
Name:
Sodium channel protein type 3 subunit alpha
Synonyms:
KIAA1356 NAC3 SCN3A_HUMAN Sodium channel alpha subunits; brain (Types I, II, III) Voltage-gated sodium channel subunit alpha Nav1.3 (Nav1.3)
Type:
Protein
Mol. Mass.:
226276.42
Organism:
Homo sapiens (Human)
Description:
Q9NY46
Residue:
2000
  
Inhibitor
Name:
BDBM50495860
Synonyms:
CHEMBL3113260
Type:
Small organic molecule
Emp. Form.:
C14H18ClN5O
Mol. Mass.:
307.779
SMILES:
Cl.Nc1nc(c[nH]1)-c1ccc(NC(=O)[C@@H]2CCCN2)cc1
: