Target
Carbonic anhydrase 2
Ligand
BDBM50344898
Substrate
Meas. Tech.
ChEMBL_1288553 (CHEMBL3118986)
Ki
690000±n/a nM
Citation
 Nishimori, IVullo, DMinakuchi, TScozzafava, AOsman, SMAlOthman, ZCapasso, CSupuran, CT Anion inhibition studies of two new ?-carbonic anhydrases from the bacterial pathogen Legionella pneumophila. Bioorg Med Chem Lett 24:1127-32 (2014)  
Target
Name:
Carbonic anhydrase 2
Synonyms:
CA-II CAC Carbonate dehydratase II Carbonic anhydrase 2 (CA-II) Carbonic anhydrase C Carbonic anhydrase II (CA-II) Carbonic anhydrase II (hCA II) | Carbonic anhydrase isoenzyme II (hCA II)
Type:
Enzyme
Mol. Mass.:
29250.71
Organism:
Homo sapiens (Human)
Description:
P00918
Residue:
260
  
Inhibitor
Name:
BDBM50344898
Synonyms:
CHEMBL1081267 | sodium perruthenate
Type:
Small organic molecule
Emp. Form.:
O4Ru
Mol. Mass.:
165.07
SMILES:
O=[Ru-](=O)(=O)=O
: