Target
Genome polyprotein
Ligand
BDBM50496204
Substrate
Meas. Tech.
ChEMBL_1294622 (CHEMBL3128537)
Ki
580±n/a nM
Citation
 Lampa, AKBergman, SMGustafsson, SSAlogheli, HAkerblom, EBLindeberg, GGSvensson, RMArtursson, PDanielson, UHKarlén, ASandström, A Novel Peptidomimetic Hepatitis C Virus NS3/4A Protease Inhibitors Spanning the P2-P1' Region. ACS Med Chem Lett 5:249-54 (2014)  
Target
Name:
Genome polyprotein
Synonyms:
NS3 protease
Type:
PROTEIN
Mol. Mass.:
19154.35
Organism:
Hepacivirus C
Description:
ChEMBL_118440
Residue:
181
  
Inhibitor
Name:
BDBM50496204
Synonyms:
CHEMBL3125169
Type:
Small organic molecule
Emp. Form.:
C40H36F3N5O8S
Mol. Mass.:
803.803
SMILES:
COc1cc(Oc2ccc(cc2C=C)C(NC(=O)OC(C)(C)C)C(=O)Nc2cccc(c2)C(=O)NS(=O)(=O)c2ccc(cc2)C(F)(F)F)nc(n1)-c1ccccc1
: