Target
Glutathione S-transferase Mu 2
Ligand
BDBM50043758
Substrate
Meas. Tech.
ChEMBL_72449 (CHEMBL682619)
Ki
36000±n/a nM
Citation
 Lyttle, MHHocker, MDHui, HCCaldwell, CGAaron, DTEngqvist-Goldstein, AFlatgaard, JEBauer, KE Isozyme-specific glutathione-S-transferase inhibitors: design and synthesis. J Med Chem 37:189-94 (1994)  
Target
Name:
Glutathione S-transferase Mu 2
Synonyms:
GST class-mu 2 GSTM2 GSTM2_HUMAN | Glutathione S-transferase Mu 2
Type:
PROTEIN
Mol. Mass.:
25743.85
Organism:
Homo sapiens (Human)
Description:
ChEMBL_1441153
Residue:
218
  
Inhibitor
Name:
BDBM50043758
Synonyms:
2-Amino-4-[1-(carboxymethyl-carbamoyl)-2-hexylsulfanyl-ethylcarbamoyl]-butyric acid | CHEMBL58135
Type:
Small organic molecule
Emp. Form.:
C16H29N3O6S
Mol. Mass.:
391.483
SMILES:
CCCCCCSCC(NC(=O)CCC(N)C(O)=O)C(=O)NCC(O)=O
: